- 1、原创力文档(book118)网站文档一经付费(服务费),不意味着购买了该文档的版权,仅供个人/单位学习、研究之用,不得用于商业用途,未经授权,严禁复制、发行、汇编、翻译或者网络传播等,侵权必究。。
- 2、本站所有内容均由合作方或网友上传,本站不对文档的完整性、权威性及其观点立场正确性做任何保证或承诺!文档内容仅供研究参考,付费前请自行鉴别。如您付费,意味着您自己接受本站规则且自行承担风险,本站不退款、不进行额外附加服务;查看《如何避免下载的几个坑》。如果您已付费下载过本站文档,您可以点击 这里二次下载。
- 3、如文档侵犯商业秘密、侵犯著作权、侵犯人身权等,请点击“版权申诉”(推荐),也可以打举报电话:400-050-0827(电话支持时间:9:00-18:30)。
- 4、该文档为VIP文档,如果想要下载,成为VIP会员后,下载免费。
- 5、成为VIP后,下载本文档将扣除1次下载权益。下载后,不支持退款、换文档。如有疑问请联系我们。
- 6、成为VIP后,您将拥有八大权益,权益包括:VIP文档下载权益、阅读免打扰、文档格式转换、高级专利检索、专属身份标志、高级客服、多端互通、版权登记。
- 7、VIP文档为合作方或网友上传,每下载1次, 网站将根据用户上传文档的质量评分、类型等,对文档贡献者给予高额补贴、流量扶持。如果你也想贡献VIP文档。上传文档
查看更多
我安装的NS2-2.33
系统环境为ubuntu11.041、首先下载ns-allinone-2.33.tar.gz。/projects/nsnam/files/allinone/ns-allinone-2.33/2、更新了一下系统。在终端输入: sudo apt-get update #更新源列表 sudo apt-get upgrade #更新已安装的包sudo apt-get dist-upgrade #更新软件,升级系统3、装几个需要使用的软件包sudo apt-get install build-essential #for gcc and some essential sudo apt-get install tcl8.4 tcl8.4-dev tk8.4 tk8.4-dev #for tcl and tksudo apt-get install libxmu-dev libxmu-headers #for nam4、安装NS2 sudo tar -vxzf ns-allinone-2.33.tar.gz #解压到当前目录/home/bt/ns2/ cd ns-allinone-2.33 #进入目录 sudo ./install #开始安装然后命令行快速刷新,确实很养眼。但不一会突然报错:……(以上省略) make: *** [libotcl.so] 错误 1 otcl-1.13 make failed! Exiting ... See /nsnam/ns/ns-problems.html for problems卡住了,很郁闷,于是上网找解决方法。在[2]上得到结果如下: gcc 4.0版本以前是用ld -share来生成共享库的,但是到了4.0以上的版本,这个命令改为了gcc -share。在终端里输入gcc -v查看,我的版本是gcc version 4.4.3。开始修改。 cd /home/bt/ns2 /ns-allinone-2.33/otcl-1.13 sudo gedit configure.in把77行的SHLIB_LD=ld -shared,改为SHLIB_LD=gcc -shared,保存退出。然后 sudo gedit configure按照[2]中的说法,在5518行, 把SHLIB_LD=ld -shared改为SHLIB_LD=gcc -shared,保存退出。 cd回到目录ns-allinone-2.33下,重新运行 sudo ./install出现错误:tools/ranvar.cc: In member function ‘virtual double GammaRandomVariable::value()’:tools/ranvar.cc:219:70: error: cannot call constructor ‘GammaRandomVariable::GammaRandomVariable’ directlytools/ranvar.cc:219:70: error: for a function-style cast, remove the redundant ‘::GammaRandomVariable’make: *** [tools/ranvar.o]错误1Ns make failed!See /nsnam/ns/ns-problems.html for problems这是由于gcc版本提高后对类内部函数调用的简化造成的不兼容,解决方法如下:?在ns-allinone-2.33/ ns-2.33/tools文件夹下,找到报错提示中的ranvar.cc文件,打开找到对应的219行删除::GaammaRandomVariable,保存,cd回到目录ns-allinone-2.33下,重新运行 sudo ./install出现同类问题时,如:mobile/nakagami.cc: In member function ‘virtual double Nakagami::Pr(PacketStamp*, PacketStamp*, WirelessPhy*)’:mobile/nakagami.cc:183:73: error: cannot call constructor ‘ErlangRandomVariable::ErlangRandomVariable’ directlymobile/nakagami.cc:183:73: error: for a function-style cast, remove the redundant ‘::
文档评论(0)